How To Resolve Configuration Error C Compiler Cannot Create Executables On Centos

Don't suffer from crashes and errors. Fix them with ASR Pro.

  • 1. Download ASR Pro and install it on your computer
  • 2. Launch the program and click "Scan" to start the scanning process
  • 3. Click "Repair" to fix any detected issues
  • Get a faster

    Last week, some of our readers encountered an error code with c configuration error, compiler cannot create executables on centos. This problem occurs for many reasons. Let’s discuss some of them below.

    Why Do I Need To Complete A CAPTCHA?

    Performing a CAPTCHA test verifies that you are a human and indeed grants you temporary access to the web resource.

    What Can I Do To Prevent This From Happening Again In The Future?

    If you’re in a private connection, such as at home, you can run a virus scan on your device to make sure it’s not infected with malware.

    Perhaps if you are in the office or meeting other people, you can ask your network administrator to scan the network for misconfigured or infected devices.

    Another way to prevent access to this search page in the future is to use the Privacy Pass. Now you should finally download version 2.0 from the Firefox add-ons store.

    We have two versions of gcc 6 and 6, but we may run into errors during installation. Please make it happen. “

    Getting configuration: error C: compiler error cannot create executable functionsFiles

    chat /etc/redhat-release
    Cancel CentOS 6.10 (Final)

    name -a
    Linux XXX 2.6.32-754.28.1.el6.x86_64 #1 SMP Tue 11 18:38:45 UTC 2020 x86_64 x86_64 x86_64 GNU/Linux

    GCC version: 6

    gcc-v
    Use built-in specifications.
    COLLECT_GCC=gcc
    COLLECT_LTO_WRAPPER=/usr/local/libexec/gcc/x86_64-pc-linux-gnu/6.1.0/lto-wrapper
    Target: x86_64-pc-linux-gnu
    Configured with: ../configure
    Thread Model: posix
    gcc version 6.1.0 (GCC)

    configure error c compiler cannot create executables on centos

    CCG4

    /usr/bin/gcc -v
    Use built-in specifications.
    Target: x86_64-redhat-linux
    Configured with: ../configure –prefix=/usr –mandir=/usr/share/man –infodir=/usr/share/info –with-bugurl=http://bugzilla.redhat.com/ bugzilla –enable-bootstrap –enable-shared –enable-checking=release –enable-threads=posix –with-system-zlib –enable-__cxa_atexit –disable-libunwind-exceptions –enable-gnu- unique -object –enable-languages=c,c++,objc,obj-c++,java,fortran,ada –enable-java-awt=gtk –disable-dssi –with-java-home=/usr/lib /jvm/java-1.5.0-gcj-1.5.0.0/jre –enable-libgcj-multifile –enable-java-maintainer-mode –with-ecj-jar=/usr/share/java/eclipse-ecj . jar –disable-libjava-multilib –with-ppl –with-tune=generic –with-cloog –with-arch_32=i686 –build=x86_64-redhat-linux
    Thread Model: posix
    gcc version 4.4.7 20120313 (Red Hat 4.4.7-23) (GCC)

    RISCV export=/usr/bin/riscv
    /root/riscv-isa-sim-master/configure –prefix=$RISCV –enable-misaligned
    Check build system type –enable-commitlog… x86_64-unknown-linux-gnu
    Checking system type selection… x86_64-unknown-linux-gnu
    Just search for gcc…gcc
    Make sure the C function compiler… is not
    configure: error: /usr/local': configure: error: C compiler cannot create executable See config.log’

    for details

    `[[email protected] plus local]# Snake config.log
    This file contains messages collected by compilers while
    Run the installer to debug the device if the installation fails.

    It was generated by the RISC-V simulator and is it a configuration? who was
    generated by GNU Autoconf 2.69. command invocation level was

    $ /root/riscv-isa-sim-master/configure –prefix=/usr/bin/riscv –enable-commitlog –enable-misaligned

    ———

    Platform.

    ———

    Host name is asic-5.enphaseenergy.com
    uname=-mx86_64
    uname -r matches 2.6.32-754.28.1.el6.x86_64
    uname -s=Linux
    uname -v= #1 SMP Wed Mar 13 18:38:45 UTC 2020

    Don't suffer from crashes and errors. Fix them with ASR Pro.

    Do you have a computer problem? You’re not alone. In fact, over 60% of computers suffer from some kind of error or crash at one point in time. ASR Pro is the best solution for fixing these problems and getting your PC back up to speed. Click here to get started:

  • 1. Download ASR Pro and install it on your computer
  • 2. Launch the program and click "Scan" to start the scanning process
  • 3. Click "Repair" to fix any detected issues

  • /usr/bin/uname -p=unknown
    /bin/uname -X=unknown

    /bin/arch implies x86_64
    /usr/bin/arch -k=unknown
    /usr/convex/getsysinfo=unknown
    /usr/bin/hostinfo equals unknown
    /bin/machine equals unknown
    /usr/bin/oslevel=unknown
    /bin/universe=unknown

    PATH: /usr/lib64/qt-3.3/bin
    PATH: /usr/share/lsf/9.1/linux2.6-glibc2.3-x86_64/etc
    PATH: /usr/share/lsf/9.1/linux2.6-glibc2.3-x86_64/bin
    PATH: /usr/local/sbin
    PATH: /usr/local/bin
    PATH: /sbin
    PATH: /bin
    PATH: /usr/sbin
    PATH: /usr/bin
    PATH: /opt/dell/srvadmin/sbin
    PATH: /opt/dell/srvadmin/bin
    Path: /root/bin

    ———–

    Basic Tests.

    ———–

    configure:2127: Assembly type parsing
    configure:2141: System result: x86_64-unknown-linux-gnu
    configure:2161: next host type
    configure: 2174: output: x86_64-unknown-linux-gnu
    configure:2393: mapping for gcc
    configure: 2409: found /usr/local/bin/gcc
    configure: 2420: Result: gcc
    configure:2649: select compiler version C
    configure: 2658: gcc –version >&5
    gcc (GCC) 6.1.0
    Copyright (C) 2016 Free Software Foundation, Inc.
    It could be software; see the free source for blocking conditions. No
    Warranty; not even considered in terms of MERCHANTABILITY or FITNESS FOR A PARTICULAR PURPOSE.

    configure error c compiler cannot create executables on centos

    Configure:2669:$? matches 0
    configure:2658: built-in gcc -v >&5
    with specifications.
    COLLECT_GCC=gcc
    COLLECT_LTO_WRAPPER=/usr/local/libexec/gcc/x86_64-pc-linux-gnu/6.1.0/lto-wrapper
    Target: x86_64-pc-linux-gnu
    Configured with: ../configure
    Thread Model: posix
    setting up gcc 6.1.0 (GCC)
    configure: 2669: $? = 0configure: 2658: -V gcc >&5
    gcc: error: unknown command line response ‘-V’
    gcc: fatal error: no slot file
    Build aborted.
    configure: 2669: $? = 1configure: 2658: gcc -qversion >&5
    gcc: error: unrecognized command line alternative ‘-qversion’; did you mean “–version” of the airport?
    gcc: error: no input file
    Build aborted.
    configure: 2669: revenue? = 1configure:2689: Check if someone’s compiler is running
    configure: 2711: gccconftest.c >&5
    /usr/bin/ld: crtbegin.o: No image: tel No such file or possibly directory
    collect2: error: ld returned 1 bet bye
    configure: 2715: $? = 1configure:2753:result:none
    configure: program did not work:
    | /* confdefs.h /
    | #define PACKAGE_NAME “RISC-V ISA Simulator”
    | #define PACKAGE_TARNAME “upper”
    | PACKAGE_VERSION #define “?”
    | #define PACKAGE_STRING “RISC-V ISA simulator?”
    | #define PACKAGE_BUGREPORT “Andrew Waterman”
    | #define PACKAGE_URL “”
    | – Close confdefs.h. */
    |
    | interval
    | most important()
    | {
    |
    | ;
    | returns 0;

    Get a faster

    John Blackwell